Target
Type-2 angiotensin II receptor
Ligand
BDBM50228195
Substrate
Meas. Tech.
ChEMBL_35279 (CHEMBL647843)
IC50
2.5±n/a nM
Citation
 Plucinska, KKataoka, TYodo, MCody, WLHe, JXHumblet, CLu, GHLunney, EMajor, TCPanek, RL Multiple binding modes for the receptor-bound conformations of cyclic AII agonists. J Med Chem 36:1902-13 (1993)  
Target
Name:
Type-2 angiotensin II receptor
Synonyms:
AGTR2 AT2 Angiotensin II type 2 (AT-2) receptor Type-2 angiotensin II receptor
Type:
Enzyme Catalytic Domain
Mol. Mass.:
41201.61
Organism:
Homo sapiens (Human)
Description:
Angiotensin II, central 0 0::P50052
Residue:
363
  
Inhibitor
Name:
BDBM50228195
Synonyms:
Angiotensin Ii | CHEBI:2719
Type:
Small organic molecule
Emp. Form.:
C50H71N13O12
Mol. Mass.:
1046.1786
SMILES:
CC[C@H](C)[C@H](NC(=O)[C@H](Cc1ccc(O)cc1)NC(=O)[C@@H](NC(=O)[C@H](CCCNC(N)=N)NC(=O)[C@@H](N)CC(O)=O)C(C)C)C(=O)N[C@@H](Cc1cnc[nH]1)C(=O)N1CCC[C@H]1C(=O)N[C@@H](Cc1ccccc1)C(O)=O
: