Target
Interleukin-1 receptor-associated kinase 4
Ligand
BDBM50499206
Substrate
Meas. Tech.
ChEMBL_1538243 (CHEMBL3737182)
Ki
1.6±n/a nM
Citation
 Wang, ZSun, DJohnstone, SCao, ZGao, XJaen, JCLiu, JLively, SMiao, SSudom, ATomooka, CWalker, NPWright, MYan, XYe, QPowers, JP Discovery of potent, selective, and orally bioavailable inhibitors of interleukin-1 receptor-associate kinase-4. Bioorg Med Chem Lett 25:5546-50 (2015)  
Target
Name:
Interleukin-1 receptor-associated kinase 4
Synonyms:
IRAK-4 IRAK4_HUMAN Interleukin-1 receptor-associated kinase 4 (IRAK4) | Renal carcinoma antigen NY-REN-64
Type:
Protein
Mol. Mass.:
51519.08
Organism:
Homo sapiens (Human)
Description:
Q9NWZ3
Residue:
460
  
Inhibitor
Name:
BDBM50499206
Synonyms:
CHEMBL3735949
Type:
Small organic molecule
Emp. Form.:
C21H21FN4O4
Mol. Mass.:
412.4142
SMILES:
OC[C@H]1CC[C@H](CC1)n1c(NC(=O)c2cccc(c2)[N+]([O-])=O)nc2cc(F)ccc12
: