Target
D(2) dopamine receptor
Ligand
BDBM50048302
Substrate
Meas. Tech.
ChEMBL_61614 (CHEMBL672911)
Ki
3.5±n/a nM
Citation
 Wright, JLDowning, DMFeng, MRHayes, RNHeffner, TGMacKenzie, RGMeltzer, LTPugsley, TAWise, LD Identification, characterization and pharmacological profile of three metabolites of (R)-(+)-1,2,3,6-tetrahydro-4-phenyl-1-[(3-phenylcyclohexen-1- yl)methyl]pyridine (CI-1007), a dopamine autoreceptor agonist and potential antipsychotic agent. J Med Chem 38:5007-14 (1996)  
Target
Name:
D(2) dopamine receptor
Synonyms:
D(2) dopamine receptor DOPAMINE D2 Long DRD2 Dopamine D2 receptor Dopamine D2 receptor (D2R) Dopamine2-like | d2
Type:
Cell-surface receptors
Mol. Mass.:
50647.10
Organism:
Homo sapiens (Human)
Description:
P14416
Residue:
443
  
Inhibitor
Name:
BDBM50048302
Synonyms:
4-[(R)-5-(4-Phenyl-3,6-dihydro-2H-pyridin-1-ylmethyl)-cyclohex-1-enyl]-phenol | CHEMBL357416
Type:
Small organic molecule
Emp. Form.:
C24H27NO
Mol. Mass.:
345.4773
SMILES:
Oc1ccc(cc1)C1=CCC[C@@H](CN2CCC(=CC2)c2ccccc2)C1
: