Target
Diacylglycerol O-acyltransferase 2
Ligand
BDBM50499293
Substrate
Meas. Tech.
ChEMBL_1538840 (CHEMBL3737415)
IC50
>12000±n/a nM
Citation
 Imbriglio, JEShen, DMLiang, RMarby, KYou, MYoum, HWFeng, ZLondon, CXiong, YTata, JVerras, AGarcia-Calvo, MSong, XAddona, GHMcLaren, DGHe, TMurphy, BMetzger, DESalituro, GDeckman, DChen, QJin, XStout, SJWang, SPWilsie, LPalyha, OHan, SHubbard, BKPrevis, SFPinto, STaggart, A Discovery and Pharmacology of a Novel Class of Diacylglycerol Acyltransferase 2 Inhibitors. J Med Chem 58:9345-53 (2015)  
Target
Name:
Diacylglycerol O-acyltransferase 2
Synonyms:
ARAT DGAT2 Diacylglycerol O-acyltransferase 2 (DGAT2) Retinol O-fatty-acyltransferase
Type:
Multi-pass membrane protein
Mol. Mass.:
43848.90
Organism:
Homo sapiens (Human)
Description:
Q96PD7
Residue:
388
  
Inhibitor
Name:
BDBM50499293
Synonyms:
CHEMBL3735532
Type:
Small organic molecule
Emp. Form.:
C17H12Cl3N3O
Mol. Mass.:
380.656
SMILES:
Clc1cccc(NC(=O)NCc2ccc(Cl)c3ccncc23)c1Cl
: