Target
Alpha-1,6-mannosyl-glycoprotein 2-beta-N-acetylglucosaminyltransferase
Ligand
BDBM50499298
Substrate
Meas. Tech.
ChEMBL_1538841 (CHEMBL3737416)
IC50
>10000±n/a nM
Citation
 Imbriglio, JEShen, DMLiang, RMarby, KYou, MYoum, HWFeng, ZLondon, CXiong, YTata, JVerras, AGarcia-Calvo, MSong, XAddona, GHMcLaren, DGHe, TMurphy, BMetzger, DESalituro, GDeckman, DChen, QJin, XStout, SJWang, SPWilsie, LPalyha, OHan, SHubbard, BKPrevis, SFPinto, STaggart, A Discovery and Pharmacology of a Novel Class of Diacylglycerol Acyltransferase 2 Inhibitors. J Med Chem 58:9345-53 (2015)  
Target
Name:
Alpha-1,6-mannosyl-glycoprotein 2-beta-N-acetylglucosaminyltransferase
Synonyms:
2.4.1.143 GNT-II MGAT2 Mannoside acetylglucosaminyltransferase 2 Monoacylglycerol acyltransferase type 2 (h-MGAT2) h-MGAT2 (human monoacylglycerol acyltransferase type 2)
Type:
Mol. Mass.:
51567.80
Organism:
Homo sapiens (Human)
Description:
Q10469
Residue:
447
  
Inhibitor
Name:
BDBM50499298
Synonyms:
CHEMBL3734847
Type:
Small organic molecule
Emp. Form.:
C29H35N5O4
Mol. Mass.:
517.6193
SMILES:
COc1cccc(c1)-c1ccc(CNC(=O)[C@H]2C[C@@H]2c2nc(C)no2)c2CN(CCc12)C(=O)NC(C)(C)C
: