Target
Polyphenol oxidase 2
Ligand
BDBM50499813
Substrate
Meas. Tech.
ChEMBL_1541431 (CHEMBL3743599)
IC50
14400±n/a nM
Citation
 Choi, JPark, SJJee, JG Analogues of ethionamide, a drug used for multidrug-resistant tuberculosis, exhibit potent inhibition of tyrosinase. Eur J Med Chem 106:157-66 (2015)  
Target
Name:
Polyphenol oxidase 2
Synonyms:
Monophenol monooxygenase PPO2 Tyrosinase
Type:
Protein
Mol. Mass.:
63923.66
Organism:
Agaricus bisporus (Common mushroom)
Description:
O42713
Residue:
556
  
Inhibitor
Name:
BDBM50499813
Synonyms:
CHEMBL3741839
Type:
Small organic molecule
Emp. Form.:
C6H6N2S
Mol. Mass.:
138.19
SMILES:
NC(=S)c1ccccn1
: