Target
Polyphenol oxidase 2
Ligand
BDBM60920
Substrate
Meas. Tech.
ChEMBL_1541431 (CHEMBL3743599)
IC50
7500±n/a nM
Citation
 Choi, JPark, SJJee, JG Analogues of ethionamide, a drug used for multidrug-resistant tuberculosis, exhibit potent inhibition of tyrosinase. Eur J Med Chem 106:157-66 (2015)  
Target
Name:
Polyphenol oxidase 2
Synonyms:
Monophenol monooxygenase PPO2 Tyrosinase
Type:
Protein
Mol. Mass.:
63923.66
Organism:
Agaricus bisporus (Common mushroom)
Description:
O42713
Residue:
556
  
Inhibitor
Name:
BDBM60920
Synonyms:
thionicotinamide
Type:
Emp. Form.:
C6H6N2S
Mol. Mass.:
138.19
SMILES:
NC(=S)c1cccnc1
: