Target
Polyphenol oxidase 2
Ligand
BDBM50499814
Substrate
Meas. Tech.
ChEMBL_1541433 (CHEMBL3743601)
Ki
2400±n/a nM
Citation
 Choi, JPark, SJJee, JG Analogues of ethionamide, a drug used for multidrug-resistant tuberculosis, exhibit potent inhibition of tyrosinase. Eur J Med Chem 106:157-66 (2015)  
Target
Name:
Polyphenol oxidase 2
Synonyms:
Monophenol monooxygenase PPO2 Tyrosinase
Type:
Protein
Mol. Mass.:
63923.66
Organism:
Agaricus bisporus (Common mushroom)
Description:
O42713
Residue:
556
  
Inhibitor
Name:
BDBM50499814
Synonyms:
Ektebin Prothionamide RP-9778 Trevintix
Type:
Small organic molecule
Emp. Form.:
C9H12N2S
Mol. Mass.:
180.27
SMILES:
CCCc1cc(ccn1)C(N)=S
: