Target
Cytochrome P450 11B2, mitochondrial
Ligand
BDBM50500189
Substrate
Meas. Tech.
ChEMBL_1545188 (CHEMBL3750669)
IC50
2.0±n/a nM
Citation
 Papillon, JPLou, CSingh, AKAdams, CMKsander, GMBeil, MEChen, WLeung-Chu, JFu, FGan, LHu, CWJeng, AYLaSala, DLiang, GRigel, DFRussell, KSVest, JAWatson, C Discovery of N-[5-(6-Chloro-3-cyano-1-methyl-1H-indol-2-yl)-pyridin-3-ylmethyl]-ethanesulfonamide, a Cortisol-Sparing CYP11B2 Inhibitor that Lowers Aldosterone in Human Subjects. J Med Chem 58:9382-94 (2015)  
Target
Name:
Cytochrome P450 11B2, mitochondrial
Synonyms:
Aldosterone Synthase (CYP11B2) Aldosterone-synthesizing enzyme CYP11B2 Cytochrome P450 11B2 Cytochrome P450 11B2, mitochondrial P-450C18 | Steroid 18-hydroxylase
Type:
Protein
Mol. Mass.:
57582.15
Organism:
Homo sapiens (Human)
Description:
P19099
Residue:
503
  
Inhibitor
Name:
BDBM50500189
Synonyms:
CHEMBL3746175
Type:
Small organic molecule
Emp. Form.:
C17H16N4O3S
Mol. Mass.:
356.399
SMILES:
CN(C)S(=O)(=O)Oc1cncc(c1)-c1c(C#N)c2ccccc2n1C
: