Target
Tubulin beta chain
Ligand
BDBM50500401
Substrate
Meas. Tech.
ChEMBL_1546324 (CHEMBL3748555)
IC50
8300±n/a nM
Citation
 Colley, HEMuthana, MDanson, SJJackson, LVBrett, MLHarrison, JCoole, SFMason, DPJennings, LRWong, MTulasi, VNorman, DLockey, PMWilliams, LDossetter, AGGriffen, EJThompson, MJ An Orally Bioavailable, Indole-3-glyoxylamide Based Series of Tubulin Polymerization Inhibitors Showing Tumor Growth Inhibition in a Mouse Xenograft Model of Head and Neck Cancer. J Med Chem 58:9309-33 (2015)  
Target
Name:
Tubulin beta chain
Synonyms:
Beta-tubulin Tubulin beta chain
Type:
PROTEIN
Mol. Mass.:
49840.26
Organism:
Sus scrofa
Description:
ChEMBL_105107
Residue:
445
  
Inhibitor
Name:
BDBM50500401
Synonyms:
CHEMBL3746593
Type:
Small organic molecule
Emp. Form.:
C21H21N3O4
Mol. Mass.:
379.4091
SMILES:
COc1ccc(NC(=O)C(=O)c2cn(CC3CCCO3)c3ccccc23)cn1
: