Target
Carbonic anhydrase 7
Ligand
BDBM50500681
Substrate
Meas. Tech.
ChEMBL_1549337 (CHEMBL3755043)
Ki
0.430000±n/a nM
Citation
 Villalba, MLPalestro, PCeruso, MGonzalez Funes, JLTalevi, ABruno Blanch, LSupuran, CTGavernet, L Sulfamide derivatives with selective carbonic anhydrase VII inhibitory action. Bioorg Med Chem 24:894-901 (2016)  
Target
Name:
Carbonic anhydrase 7
Synonyms:
CA-VII CAH7_HUMAN Carbonic anhydrase Carbonic anhydrase VII (CA VII)
Type:
Enzyme
Mol. Mass.:
29664.11
Organism:
Homo sapiens (Human)
Description:
Human cloned isozyme.
Residue:
264
  
Inhibitor
Name:
BDBM50500681
Synonyms:
CHEMBL3754723
Type:
Small organic molecule
Emp. Form.:
C14H24N2O4S
Mol. Mass.:
316.416
SMILES:
COC(=O)CCNS(=O)(=O)NC12CC3CC(CC(C3)C1)C2
: