Target
Reverse transcriptase/RNaseH
Ligand
BDBM2337
Substrate
Meas. Tech.
ChEMBL_195512 (CHEMBL872992)
IC50
8±n/a nM
Citation
 Hopkins, ALRen, JEsnouf, RMWillcox, BEJones, EYRoss, CMiyasaka, TWalker, RTTanaka, HStammers, DKStuart, DI Complexes of HIV-1 reverse transcriptase with inhibitors of the HEPT series reveal conformational changes relevant to the design of potent non-nucleoside inhibitors. J Med Chem 39:1589-600 (1996)  
Target
Name:
Reverse transcriptase/RNaseH
Synonyms:
HIV-1 Reverse Transcriptase RNase H Reverse transcriptase/RNaseH
Type:
PROTEIN
Mol. Mass.:
65229.15
Organism:
Human immunodeficiency virus 1
Description:
ChEMBL_1473730
Residue:
566
  
Inhibitor
Name:
BDBM2337
Synonyms:
6-benzyl-1-(ethoxymethyl)-5-(propan-2-yl)-1,2,3,4-tetrahydropyrimidine-2,4-dione Coactinon Emivirine (EMV) I-EBU | MKC-442
Type:
Small organic molecule
Emp. Form.:
C17H22N2O3
Mol. Mass.:
302.3682
SMILES:
CCOCn1c(Cc2ccccc2)c(C(C)C)c(=O)[nH]c1=O
: