Target
Neuromedin-U receptor 1
Ligand
BDBM50049421
Substrate
Meas. Tech.
ChEMBL_1550246 (CHEMBL3760529)
EC50
1.1±n/a nM
Citation
 Micewicz, EDBahattab, OSWillars, GBWaring, AJNavab, MWhitelegge, JPMcBride, WHRuchala, P Small lipidated anti-obesity compounds derived from neuromedin U. Eur J Med Chem 101:616-26 (2015)  
Target
Name:
Neuromedin-U receptor 1
Synonyms:
G-protein coupled receptor 66 GPR66 NMUR1 Neuromedin-U receptor 1
Type:
PROTEIN
Mol. Mass.:
47370.42
Organism:
Homo sapiens (Human)
Description:
ChEMBL_103121
Residue:
426
  
Inhibitor
Name:
BDBM50049421
Synonyms:
CHEMBL3315349
Type:
Small organic molecule
Emp. Form.:
C141H203N41O38
Mol. Mass.:
3080.3724
SMILES:
CC(C)C[C@H](NC(=O)[C@H](Cc1ccccc1)NC(=O)[C@H](Cc1ccc(O)cc1)NC(=O)CNC(=O)[C@H](CCCNC(N)=N)NC(=O)[C@H](CO)NC(=O)[C@H](CCC(N)=O)NC(=O)[C@H](CO)NC(=O)[C@H](C)NC(=O)[C@H](Cc1ccccc1)NC(=O)[C@@H]1CCCN1C(=O)[C@H](CO)NC(=O)[C@H](CCC(N)=O)NC(=O)[C@H](Cc1ccccc1)NC(=O)[C@H](CCC(O)=O)NC(=O)[C@H](CCC(O)=O)NC(=O)[C@H](CC(O)=O)NC(=O)[C@@H](NC(=O)[C@H](CCCNC(N)=N)NC(=O)[C@@H](N)Cc1ccccc1)C(C)C)C(=O)N[C@@H](Cc1ccccc1)C(=O)N[C@@H](CCCNC(N)=N)C(=O)N1CCC[C@H]1C(=O)N[C@@H](CCCNC(N)=N)C(=O)N[C@@H](CC(N)=O)C(N)=O
: