Target
5-hydroxytryptamine receptor 1A
Ligand
BDBM50051168
Substrate
Meas. Tech.
ChEMBL_1116 (CHEMBL616061)
Ki
1330±n/a nM
Citation
 Mokrosz, JLDeren-Wesolek, ATatarczynska, EDuszynska, BBojarski, AJMokrosz, MJChojnacka-Wójcik, E 8-[4-[2-(1,2,3,4-Tetrahydroisoquinolinyl]butyl-8-azaspiro[4.5]decane-7,9-dione: a new 5-HT1A receptor ligand with the same activity profile as buspirone. J Med Chem 39:1125-9 (1996)  
Target
Name:
5-hydroxytryptamine receptor 1A
Synonyms:
5-HT-1A 5-HT1A 5-hydroxytryptamine receptor 1A (5HT1A) 5ht1a Htr1a Serotonin 1a (5-HT1a) receptor/Adrenergic receptor alpha-1 | Serotonin receptor 1A
Type:
G Protein-Coupled Receptor (GPCR)
Mol. Mass.:
46445.29
Organism:
Rattus norvegicus (rat)
Description:
Binding assays were performed using rat hippocampal membranes.
Residue:
422
  
Inhibitor
Name:
BDBM50051168
Synonyms:
8-[2-(3,4-Dihydro-1H-isoquinolin-2-yl)-ethyl]-8-aza-spiro[4.5]decane-7,9-dione | CHEMBL14209
Type:
Small organic molecule
Emp. Form.:
C20H26N2O2
Mol. Mass.:
326.4326
SMILES:
O=C1CC2(CCCC2)CC(=O)N1CCN1CCc2ccccc2C1
: