Target
Histamine H3 receptor
Ligand
BDBM50051182
Substrate
Meas. Tech.
ChEMBL_86902 (CHEMBL698412)
Ki
69±n/a nM
Citation
 Stark, HPurand, KLigneau, XRouleau, AArrang, JMGarbarg, MSchwartz, JCSchunack, W Novel carbamates as potent histamine H3 receptor antagonists with high in vitro and oral in vivo activity. J Med Chem 39:1157-63 (1996)  
Target
Name:
Histamine H3 receptor
Synonyms:
HH3R Hrh3
Type:
G Protein-Coupled Receptor (GPCR)
Mol. Mass.:
48607.98
Organism:
Rattus norvegicus (rat)
Description:
Residue:
445
  
Inhibitor
Name:
BDBM50051182
Synonyms:
CHEMBL16593 | Cyclohexyl-carbamic acid 3-(1H-imidazol-4-yl)-propyl ester
Type:
Small organic molecule
Emp. Form.:
C13H21N3O2
Mol. Mass.:
251.3247
SMILES:
O=C(NC1CCCCC1)OCCCc1cnc[nH]1
: