Target
Corticotropin-releasing factor receptor 1
Ligand
BDBM50300145
Substrate
Meas. Tech.
ChEMBL_1575833 (CHEMBL3801876)
IC50
0.290000±n/a nM
Citation
 Ahuja, VTHartz, RAMolski, TFMattson, GKLentz, KAGrace, JELodge, NJBronson, JJMacor, JE Synthesis and evaluation of carbamate and aryl ether substituted pyrazinones as corticotropin releasing factor-1 (CRF?) receptor antagonists. Bioorg Med Chem Lett 26:2184-7 (2016)  
Target
Name:
Corticotropin-releasing factor receptor 1
Synonyms:
CRF-R CRFR1_RAT Corticotropin releasing factor receptor Corticotropin-releasing Factor Receptor 1 Crhr | Crhr1
Type:
G Protein-Coupled Receptor (GPCR)
Mol. Mass.:
47870.75
Organism:
Rattus norvegicus (rat)
Description:
Receptor binding assays were performed using rat cortex homogenate.
Residue:
415
  
Inhibitor
Name:
BDBM50300145
Synonyms:
(S)-5-Chloro-1-(cyclopropyl-2-methoxyethyl)-3-[6-(difluoromethoxy)-2,5-dimethylpyridin-3-ylamino]pyrazin-2(1H)-one CHEMBL574852
Type:
Small organic molecule
Emp. Form.:
C18H21ClF2N4O3
Mol. Mass.:
414.834
SMILES:
COC[C@H](C1CC1)n1cc(Cl)nc(Nc2cc(C)c(OC(F)F)nc2C)c1=O
: