Target
60 kDa heat shock protein, mitochondrial
Ligand
BDBM50495816
Substrate
Meas. Tech.
ChEMBL_1578874 (CHEMBL3813272)
IC50
26000±n/a nM
Citation
 Abdeen, SSalim, NMammadova, NSummers, CMFrankson, RAmbrose, AJAnderson, GGSchultz, PGHorwich, ALChapman, EJohnson, SM GroEL/ES inhibitors as potential antibiotics. Bioorg Med Chem Lett 26:3127-3134 (2016)  
Target
Name:
60 kDa heat shock protein, mitochondrial
Synonyms:
3.6.4.9 60 kDa heat shock protein, mitochondrial CPN60 HSP-60 HSP60/HSP10 Heat shock protein 60 Mitochondrial matrix protein P1 | P60 lymphocyte protein
Type:
PROTEIN
Mol. Mass.:
61050.41
Organism:
Homo sapiens
Description:
ChEMBL_117701
Residue:
573
  
Inhibitor
Name:
BDBM50495816
Synonyms:
CHEMBL3116088
Type:
Small organic molecule
Emp. Form.:
C24H21FN4O4S
Mol. Mass.:
480.511
SMILES:
COc1cc(\C=C2\C(=N)N3N=C(CC(C)C)SC3=NC2=O)ccc1OC(=O)c1ccc(F)cc1
: