Target
Co-chaperonin GroES
Ligand
BDBM50495808
Substrate
Meas. Tech.
ChEMBL_1578862 (CHEMBL3813260)
IC50
2400±n/a nM
Citation
 Abdeen, SSalim, NMammadova, NSummers, CMFrankson, RAmbrose, AJAnderson, GGSchultz, PGHorwich, ALChapman, EJohnson, SM GroEL/ES inhibitors as potential antibiotics. Bioorg Med Chem Lett 26:3127-3134 (2016)  
Target
Name:
Co-chaperonin GroES
Synonyms:
10 kDa chaperonin A8C65_01575 A8M42_07845 A9R57_13540 AC067_05500 ACN002_4371 ACN81_06320 ACU90_27615 AKG99_18190 AM270_14495 AM464_15775 AMK83_27455 AML35_20700 APT94_02240 APZ14_01130 AU473_28150 AUS26_18730 AW106_26295 AWF59_005880 AWP75_27435 AZE01_18035 AZZ83_002780 B7C53_14120 B9N28_21675 B9T59_10255 BANRA_00146 BANRA_02829 BE963_12225 BER14_11405 BFD68_08445 BHF46_15620 BHS87_23220 BIU72_06100 BJJ90_23455 BK292_23450 BK373_03445 BK383_12935 BMR23_13235 BMT53_11940 BN17_41221 BON66_25755 BON76_04280 BON92_18270 BON96_03710 BTQ04_18130 BUE81_24320 BW690_22400 BXT93_23585 BZL69_06915 BvCms2454_04386 BvCmsA75A_02317 BvCmsF63A_01378 BvCmsHHP001_00680 BvCmsHHP056_01306 BvCmsKKP036_00133 BvCmsKSNP019_03304 BvCmsKSNP081_01938 BvCmsKSP008_05436 BvCmsKSP015_03625 BvCmsKSP024_01293 BvCmsKSP036_01507 BvCmsKSP040_00954 BvCmsKSP054_04831 BvCmsKSP061_02113 BvCmsKSP076_00896 BvCmsKSP083_02936 BvCmsNSNP023_02527 BvCmsNSNP036_02364 BvCmsNSP007_04897 BvCmsNSP045_04078 BvCmsNSP052_03162 BvCmsNSP078_00003 BvCmsSINP011_01478 BvCmsSINP036_01421 BvCmsSIP010_01339 BvCmsSIP044_04390 C1I57_02520 C2858_12000 C2U48_11805 C3B70_03750 C4J69_05790 C4K41_15735 C5715_24365 C5P01_11480 C5P44_18545 C6669_06705 C6986_26905 C6B13_11450 C7B02_22875 C7B07_19645 C7B18_22130 C9025_24795 C9200_11075 C9255_05365 C9E25_08285 C9Y80_28145 C9Z12_10190 CCZ08_19870 CCZ14_19965 CCZ17_16285 CDL37_19960 CG692_00050 CG706_19955 CI694_17135 CLH66_25390 COD46_17605 CQP61_24790 CR539_02655 CRE06_15180 CRT43_24980 CRT55_26570 CT143_14480 CU078_13315 CV83915_01889 CWM24_06440 CXB56_25450 D0X26_12775 D1912_29305 D2184_07880 D2F89_07875 D3822_10755 D3I61_24430 D3Y67_00550 D4M06_29415 D7K66_01650 D9D20_08435 D9D33_02515 D9E34_15020 D9E49_11980 D9G42_15390 D9H53_05450 D9H70_08855 D9I11_08165 D9I20_17830 D9I88_12300 D9J03_08610 D9J44_18170 D9J60_12280 D9K54_26345 D9L89_29685 D9N32_18885 D9X97_28715 DAH27_28005 DAH37_06375 DD762_21025 DEN86_00715 DEO11_24175 DIV10_26325 DIV22_13640 DIV25_24085 DK268_16990 DK278_16490 DK288_16410 DKP82_04070 DKP87_04525 DL195_09035 DL545_22735 DM102_08865 DMI04_11455 DNB37_06990 DNK79_13905 DNQ45_22690 DNX30_08340 DOY56_08405 DP258_24465 DQE83_13430 DQO13_25445 DS966_08015 DS986_22660 DTL43_02180 DTL90_17415 DTM25_10760 DTM45_21120 DU333_08470 DWB25_22560 E0E06_20440 E2119_06640 E2132_24260 E2863_05074 EAI42_02215 EAI52_08830 EB510_02855 EB515_27860 EC3234A_108c00490 EC382_20325 ECONIH1_24680 ECTO6_04344 ED225_08650 ED600_23000 ED611_08920 ED903_07135 ED944_28235 EEA45_28010 EF173_02245 EFV08_22895 EGY17_11620 EIA21_18800 EJH97_22055 EL75_4023 EL80_4117 ELU85_14360 ELV07_19830 ELV13_23120 ELV32_12775 EO241_15020 EPS91_16030 EPS97_10035 EQ820_09385 EQ825_11040 ERL57_15315 ERS085366_02368 ERS085379_04165 ERS085386_01026 ERS085406_00138 ERS085416_03699 ERS150873_01288 EVY14_04865 EWK56_08840 EXM29_20520 EXX13_20065 EXX24_09470 EXX55_21115 EXX78_13725 EYD11_20735 Eco118UI_24465 ExPECSC036_01159 ExPECSC065_03192 FORC82_4347 GroES protein HW43_02405 HmCmsJML074_01332 HmCmsJML146_00634 JD73_27615 MS6198_48620 NCTC10082_01858 NCTC10418_06722 NCTC10766_04979 NCTC10865_05651 NCTC11112_02718 NCTC11126_02234 NCTC11341_03018 NCTC12950_04950 NCTC13127_05945 NCTC13353_01581 NCTC13846_04308 NCTC7152_04525 NCTC7927_05028 NCTC8009_07994 NCTC8196_00513 NCTC8500_05096 NCTC8622_02020 NCTC8960_02052 NCTC9006_03367 NCTC9010_04690 NCTC9037_04612 NCTC9045_05355 NCTC9055_01425 NCTC9060_03946 NCTC9073_03985 NCTC9077_05691 NCTC9111_04721 NCTC9119_04736 NCTC9701_04823 NCTC9706_01823 NCTC9777_00951 NCTC9965_04673 PGD_03324 Protein Cpn10 RK56_012240 SAMEA3472033_01790 SAMEA3472047_01721 SAMEA3472056_01661 SAMEA3472070_02800 SAMEA3472089_02867 SAMEA3472108_01593 SAMEA3472112_01088 SAMEA3472115_00493 SAMEA3472127_01594 SAMEA3484427_02050 SAMEA3484433_02854 SAMEA3485101_04770 SAMEA3485113_03473 SAMEA3751400_04221 SAMEA3752379_00846 SAMEA3752557_01638 SAMEA3752620_03453 SAMEA3753064_01579 SAMEA3753093_02617 SAMEA3753137_03296 SAMEA3753290_02068 SAMEA3753304_04546 SAMEA3753397_02630 SY51_23890 UC41_03560 UN91_24960 WQ89_21770 YDC107_2865 groS_2 | mopB
Type:
PROTEIN
Mol. Mass.:
10384.31
Organism:
Escherichia coli
Description:
ChEMBL_117709
Residue:
97
  
Inhibitor
Name:
BDBM50495808
Synonyms:
CHEMBL1557710
Type:
Small organic molecule
Emp. Form.:
C21H18N4O3
Mol. Mass.:
374.3926
SMILES:
O=C(Nc1ccc2nc(-c3ccco3)c(nc2c1)-c1ccco1)N1CCCC1
: