Target
60 kDa heat shock protein, mitochondrial
Ligand
BDBM42034
Substrate
Meas. Tech.
ChEMBL_1578874 (CHEMBL3813272)
IC50
3300±n/a nM
Citation
 Abdeen, SSalim, NMammadova, NSummers, CMFrankson, RAmbrose, AJAnderson, GGSchultz, PGHorwich, ALChapman, EJohnson, SM GroEL/ES inhibitors as potential antibiotics. Bioorg Med Chem Lett 26:3127-3134 (2016)  
Target
Name:
60 kDa heat shock protein, mitochondrial
Synonyms:
3.6.4.9 60 kDa heat shock protein, mitochondrial CPN60 HSP-60 HSP60/HSP10 Heat shock protein 60 Mitochondrial matrix protein P1 | P60 lymphocyte protein
Type:
PROTEIN
Mol. Mass.:
61050.41
Organism:
Homo sapiens
Description:
ChEMBL_117701
Residue:
573
  
Inhibitor
Name:
BDBM42034
Synonyms:
4-(3-nitro-4-oxidanyl-phenyl)-3a,4,5,9b-tetrahydro-3H-cyclopenta[c]quinoline-6-carboxylic acid 4-(4-hydroxy-3-nitrophenyl)-3a,4,5,9b-tetrahydro-3H-cyclopenta[c]quinoline-6-carboxylic acid cid_4182169
Type:
Small organic molecule
Emp. Form.:
C19H16N2O5
Mol. Mass.:
352.3407
SMILES:
OC(=O)c1cccc2C3C=CCC3C(Nc12)c1ccc(O)c(c1)[N+]([O-])=O
: