Target
60 kDa heat shock protein, mitochondrial
Ligand
BDBM50495819
Substrate
Meas. Tech.
ChEMBL_1578875 (CHEMBL3813273)
IC50
>250000±n/a nM
Citation
 Abdeen, SSalim, NMammadova, NSummers, CMFrankson, RAmbrose, AJAnderson, GGSchultz, PGHorwich, ALChapman, EJohnson, SM GroEL/ES inhibitors as potential antibiotics. Bioorg Med Chem Lett 26:3127-3134 (2016)  
Target
Name:
60 kDa heat shock protein, mitochondrial
Synonyms:
3.6.4.9 60 kDa heat shock protein, mitochondrial CPN60 HSP-60 HSP60/HSP10 Heat shock protein 60 Mitochondrial matrix protein P1 | P60 lymphocyte protein
Type:
PROTEIN
Mol. Mass.:
61050.41
Organism:
Homo sapiens
Description:
ChEMBL_117701
Residue:
573
  
Inhibitor
Name:
BDBM50495819
Synonyms:
CHEMBL3115924
Type:
Small organic molecule
Emp. Form.:
C18H13NO3S
Mol. Mass.:
323.366
SMILES:
O=C(Nc1ccc(cc1)C(=O)\C=C\c1ccco1)c1cccs1
: