Target
60 kDa heat shock protein, mitochondrial
Ligand
BDBM50495821
Substrate
Meas. Tech.
ChEMBL_1578874 (CHEMBL3813272)
IC50
1600±n/a nM
Citation
 Abdeen, SSalim, NMammadova, NSummers, CMFrankson, RAmbrose, AJAnderson, GGSchultz, PGHorwich, ALChapman, EJohnson, SM GroEL/ES inhibitors as potential antibiotics. Bioorg Med Chem Lett 26:3127-3134 (2016)  
Target
Name:
60 kDa heat shock protein, mitochondrial
Synonyms:
3.6.4.9 60 kDa heat shock protein, mitochondrial CPN60 HSP-60 HSP60/HSP10 Heat shock protein 60 Mitochondrial matrix protein P1 | P60 lymphocyte protein
Type:
PROTEIN
Mol. Mass.:
61050.41
Organism:
Homo sapiens
Description:
ChEMBL_117701
Residue:
573
  
Inhibitor
Name:
BDBM50495821
Synonyms:
CHEMBL3115912
Type:
Small organic molecule
Emp. Form.:
C20H14N2O5
Mol. Mass.:
362.3356
SMILES:
[O-][N+](=O)c1cccc(\C=C\C(=O)c2ccc(NC(=O)c3ccco3)cc2)c1
: