Target
60 kDa heat shock protein, mitochondrial
Ligand
BDBM50495815
Substrate
Meas. Tech.
ChEMBL_1578875 (CHEMBL3813273)
IC50
106000±n/a nM
Citation
 Abdeen, SSalim, NMammadova, NSummers, CMFrankson, RAmbrose, AJAnderson, GGSchultz, PGHorwich, ALChapman, EJohnson, SM GroEL/ES inhibitors as potential antibiotics. Bioorg Med Chem Lett 26:3127-3134 (2016)  
Target
Name:
60 kDa heat shock protein, mitochondrial
Synonyms:
3.6.4.9 60 kDa heat shock protein, mitochondrial CPN60 HSP-60 HSP60/HSP10 Heat shock protein 60 Mitochondrial matrix protein P1 | P60 lymphocyte protein
Type:
PROTEIN
Mol. Mass.:
61050.41
Organism:
Homo sapiens
Description:
ChEMBL_117701
Residue:
573
  
Inhibitor
Name:
BDBM50495815
Synonyms:
CHEMBL3115908
Type:
Small organic molecule
Emp. Form.:
C27H24N4O4S2
Mol. Mass.:
532.634
SMILES:
Cc1ccc(cc1)S(=O)(=O)Nc1ccc(cc1)-c1nc2ccc(NS(=O)(=O)c3ccc(C)cc3)cc2[nH]1
: