Target
60 kDa heat shock protein, mitochondrial
Ligand
BDBM50501230
Substrate
Meas. Tech.
ChEMBL_1617698 (CHEMBL3859767)
IC50
11000±n/a nM
Citation
 Abdeen, SSalim, NMammadova, NSummers, CMGoldsmith-Pestana, KMcMahon-Pratt, DSchultz, PGHorwich, ALChapman, EJohnson, SM Targeting the HSP60/10 chaperonin systems of Trypanosoma brucei as a strategy for treating African sleeping sickness. Bioorg Med Chem Lett 26:5247-5253 (2016)  
Target
Name:
60 kDa heat shock protein, mitochondrial
Synonyms:
3.6.4.9 60 kDa heat shock protein, mitochondrial CPN60 HSP-60 HSP60/HSP10 Heat shock protein 60 Mitochondrial matrix protein P1 | P60 lymphocyte protein
Type:
PROTEIN
Mol. Mass.:
61050.41
Organism:
Homo sapiens
Description:
ChEMBL_117701
Residue:
573
  
Inhibitor
Name:
BDBM50501230
Synonyms:
CHEMBL3986320
Type:
Small organic molecule
Emp. Form.:
C25H19N3O7S2
Mol. Mass.:
537.564
SMILES:
Oc1ccc(cc1)S(=O)(=O)Nc1ccc(cc1)-c1nc2cc(NS(=O)(=O)c3ccc(O)cc3)ccc2o1
: