Target
5-hydroxytryptamine receptor 2C
Ligand
BDBM50052337
Substrate
Meas. Tech.
ChEMBL_2959 (CHEMBL617899)
Ki
0.300000±n/a nM
Citation
 Monte, APMarona-Lewicka, DParker, MAWainscott, DBNelson, DLNichols, DE Dihydrobenzofuran analogues of hallucinogens. 3. Models of 4-substituted (2,5-dimethoxyphenyl)alkylamine derivatives with rigidified methoxy groups. J Med Chem 39:2953-61 (1996)  
Target
Name:
5-hydroxytryptamine receptor 2C
Synonyms:
5-HT-2C 5-HT2C-INI 5-HTR2C 5-hydroxytryptamine receptor 2C (5-HT-2C) 5HT-1C HTR1C Serotonin (5-HT3) receptor Serotonin Receptor 2C
Type:
G Protein-Coupled Receptor (GPCR)
Mol. Mass.:
51836.79
Organism:
Homo sapiens (Human)
Description:
P28335
Residue:
458
  
Inhibitor
Name:
BDBM50052337
Synonyms:
2-(8-bromo-2,3,6,7-tetrahydro-benzo[1,2-b;4,5-b']difuran-4-yl)-1-methyl-ethylamine | CHEMBL101008
Type:
Small organic molecule
Emp. Form.:
C13H16BrNO2
Mol. Mass.:
298.176
SMILES:
CC(N)Cc1c2CCOc2c(Br)c2CCOc12
: