Target
Retinoic acid receptor RXR-alpha
Ligand
BDBM50052588
Substrate
Meas. Tech.
ChEMBL_196752 (CHEMBL879251)
EC50
5±n/a nM
Citation
 Canan Koch, SSDardashti, LJHebert, JJWhite, SKCroston, GEFlatten, KSHeyman, RANadzan, AM Identification of the first retinoid X, receptor homodimer antagonist. J Med Chem 39:3229-34 (1996)  
Target
Name:
Retinoic acid receptor RXR-alpha
Synonyms:
NR2B1 Nuclear receptor subfamily 4 group A member 2 RXRA Retinoic acid receptor RXR-alpha/gamma Retinoid receptor
Type:
PROTEIN
Mol. Mass.:
50820.38
Organism:
Homo sapiens (Human)
Description:
ChEMBL_1456363
Residue:
462
  
Inhibitor
Name:
BDBM50052588
Synonyms:
(2E,4E,6Z)-7-(3-Methoxy-5,5,8,8-tetramethyl-5,6,7,8-tetrahydro-naphthalen-2-yl)-3-methyl-octa-2,4,6-trienoic acid | CHEMBL111589
Type:
Small organic molecule
Emp. Form.:
C24H32O3
Mol. Mass.:
368.5091
SMILES:
COc1cc2c(cc1\C(C)=C/C=C/C(/C)=C/C(O)=O)C(C)(C)CCC2(C)C
: