Target
Glutamate receptor ionotropic, kainate 2
Ligand
BDBM50002369
Substrate
Meas. Tech.
ChEMBL_90595 (CHEMBL701552)
Ki
3.7±n/a nM
Citation
 Cantrell, BEZimmerman, DMMonn, JAKamboj, RKHoo, KHTizzano, JPPullar, IAFarrell, LNBleakman, D Synthesis of a series of aryl kainic acid analogs and evaluation in cells stably expressing the kainate receptor humGluR6. J Med Chem 39:3617-24 (1996)  
Target
Name:
Glutamate receptor ionotropic, kainate 2
Synonyms:
GRIK2_RAT Glutamate receptor ionotropic kainate 2 Ionotropic glutamate receptor kainate 2/5
Type:
PROTEIN
Mol. Mass.:
102478.61
Organism:
Rattus norvegicus
Description:
ChEMBL_936439
Residue:
908
  
Inhibitor
Name:
BDBM50002369
Synonyms:
(2S-(2alpha,3beta,4beta))-2-carboxy-4-(1-methylethenyl)-3-pyrrolidineacetic acid CHEMBL275040 Digensaeure Kainate L-alpha-kainic acid digenic acid | kainic acid
Type:
Small organic molecule
Emp. Form.:
C10H15NO4
Mol. Mass.:
213.2304
SMILES:
CC(=C)[C@H]1CN[C@@H]([C@H]1CC(O)=O)C(O)=O
: