Target
Retinoic acid receptor RXR-alpha
Ligand
BDBM50407931
Substrate
Meas. Tech.
ChEMBL_196617 (CHEMBL800653)
Kd
16±n/a nM
Citation
 Muccio, DDBrouillette, WJAlam, MVaezi, MFSani, BPVenepally, PReddy, LLi, ENorris, AWSimpson-Herren, LHill, DL Conformationally defined 6-s-trans-retinoic acid analogs. 3. Structure-activity relationships for nuclear receptor binding, transcriptional activity, and cancer chemopreventive activity. J Med Chem 39:3625-35 (1996)  
Target
Name:
Retinoic acid receptor RXR-alpha
Synonyms:
NR2B1 Nuclear receptor subfamily 4 group A member 2 RXRA Retinoic acid receptor RXR-alpha/gamma Retinoid receptor
Type:
PROTEIN
Mol. Mass.:
50820.38
Organism:
Homo sapiens (Human)
Description:
ChEMBL_1456363
Residue:
462
  
Inhibitor
Name:
BDBM50407931
Synonyms:
CHEMBL2114968
Type:
Small organic molecule
Emp. Form.:
C21H30O2
Mol. Mass.:
314.4617
SMILES:
CCC1=C(C(C)C)\C(CCC1)=C\C(\C)=C/C=C/C(/C)=C/C(O)=O
: