Target
Phosphatidylinositol 3-kinase catalytic subunit type 3
Ligand
BDBM50156294
Substrate
Meas. Tech.
ChEMBL_1809523 (CHEMBL4308983)
IC50
0.018000±n/a nM
Citation
 He, SLi, QJiang, XLu, XFeng, FQu, WChen, YSun, H Design of Small Molecule Autophagy Modulators: A Promising Druggable Strategy. J Med Chem 61:4656-4687 (2018)  
Target
Name:
Phosphatidylinositol 3-kinase catalytic subunit type 3
Synonyms:
BC033004 PIK3C3 Phosphatidylinositol 3-kinase catalytic subunit type 3 (PIK3C3) Phosphoinositide 3-Kinase (PI3K), Vps34 PtdIns-3-kinase type 3 hVPS34
Type:
Enzyme
Mol. Mass.:
101551.30
Organism:
Homo sapiens (Human)
Description:
Recombinant human Vps34 protein was expressed as monomeric GST-fusion and purified.
Residue:
887
  
Inhibitor
Name:
BDBM50156294
Synonyms:
CHEMBL3781415
Type:
Small organic molecule
Emp. Form.:
C17H17N7
Mol. Mass.:
319.3638
SMILES:
Nc1ncc(c(CC2CC2)n1)-c1ccnc(Nc2ccncc2)n1
: