Target
Melanocortin receptor 4
Ligand
BDBM50164806
Substrate
Meas. Tech.
ChEMBL_1809721 (CHEMBL4309181)
EC50
2.0±n/a nM
Citation
 Lensing, CJFreeman, KTSchnell, SMSpeth, RCZarth, ATHaskell-Luevano, C Developing a Biased Unmatched Bivalent Ligand (BUmBL) Design Strategy to Target the GPCR Homodimer Allosteric Signaling (cAMP over ?-Arrestin 2 Recruitment) Within the Melanocortin Receptors. J Med Chem 62:144-158 (2019)  
Target
Name:
Melanocortin receptor 4
Synonyms:
MC4-R MC4R_HUMAN Melanocortin receptor 4 (MC-4) Melanocortin receptor 4 (MC4R)
Type:
Enzyme
Mol. Mass.:
36949.50
Organism:
Homo sapiens (Human)
Description:
P32245
Residue:
332
  
Inhibitor
Name:
BDBM50164806
Synonyms:
CHEMBL3799563
Type:
Small organic molecule
Emp. Form.:
C46H67N13O10
Mol. Mass.:
962.1053
SMILES:
NCCCOCCOCCOCCCNC(=O)COCC(=O)N[C@@H](Cc1cnc[nH]1)C(=O)N[C@H](Cc1ccccc1)C(=O)N[C@@H](CCCNC(N)=N)C(=O)N[C@@H](Cc1c[nH]c2ccccc12)C(N)=O
: