Target
Isocitrate dehydrogenase [NADP], mitochondrial
Ligand
BDBM50503251
Substrate
Meas. Tech.
ChEMBL_1809913 (CHEMBL4309373)
IC50
262±n/a nM
Citation
 Ma, TZou, FPusch, SXu, Yvon Deimling, AZha, X Inhibitors of Mutant Isocitrate Dehydrogenases 1 and 2 (mIDH1/2): An Update and Perspective. J Med Chem 61:8981-9003 (2018)  
Target
Name:
Isocitrate dehydrogenase [NADP], mitochondrial
Synonyms:
IDH2 IDHP_HUMAN | Isocitrate dehydrogenase 2 (IDH2)
Type:
Protein
Mol. Mass.:
50923.31
Organism:
Homo sapiens (Human)
Description:
Full-length wild-type
Residue:
452
  
Inhibitor
Name:
BDBM50503251
Synonyms:
AG-221 CC-90007 Free Base US10946023, Compound 288
Type:
Small organic molecule
Emp. Form.:
C19H17F6N7O
Mol. Mass.:
473.375
SMILES:
CC(C)(O)CNc1nc(Nc2ccnc(c2)C(F)(F)F)nc(n1)-c1cccc(n1)C(F)(F)F
: