Target
Delta-type opioid receptor
Ligand
BDBM50503610
Substrate
Meas. Tech.
ChEMBL_1811155 (CHEMBL4310615)
Ki
2.1±n/a nM
Citation
 Inagaki, MKume, MTamura, YHara, SGoto, YHaga, NHasegawa, TNakamura, TKoike, KOonishi, SKanemasa, TKai, H Discovery of naldemedine: A potent and orally available opioid receptor antagonist for treatment of opioid-induced adverse effects. Bioorg Med Chem Lett 29:73-77 (2019)  
Target
Name:
Delta-type opioid receptor
Synonyms:
D-OR-1 Delta opioid receptor OPIATE Delta OPRD1 OPRK1 | opioid receptor, delta 1
Type:
G Protein-Coupled Receptor (GPCR)
Mol. Mass.:
40382.98
Organism:
Homo sapiens (Human)
Description:
Competition binding assays were carried out using membrane preparations from transfected HN9.10 cells that constitutively expressed the delta opioid receptor.
Residue:
372
  
Inhibitor
Name:
BDBM50503610
Synonyms:
CHEMBL4516674
Type:
Small organic molecule
Emp. Form.:
C23H26N4O3
Mol. Mass.:
406.4775
SMILES:
[H][C@@]12Oc3c4c(C[C@@]5([H])N(CC6CC6)CC[C@@]14[C@@]5(O)Cc1c(C)nc(N)nc21)ccc3O
: