Target
Delta-type opioid receptor
Ligand
BDBM50278337
Substrate
Meas. Tech.
ChEMBL_1811155 (CHEMBL4310615)
Ki
3460±n/a nM
Citation
 Inagaki, MKume, MTamura, YHara, SGoto, YHaga, NHasegawa, TNakamura, TKoike, KOonishi, SKanemasa, TKai, H Discovery of naldemedine: A potent and orally available opioid receptor antagonist for treatment of opioid-induced adverse effects. Bioorg Med Chem Lett 29:73-77 (2019)  
Target
Name:
Delta-type opioid receptor
Synonyms:
D-OR-1 Delta opioid receptor OPIATE Delta OPRD1 OPRK1 | opioid receptor, delta 1
Type:
G Protein-Coupled Receptor (GPCR)
Mol. Mass.:
40382.98
Organism:
Homo sapiens (Human)
Description:
Competition binding assays were carried out using membrane preparations from transfected HN9.10 cells that constitutively expressed the delta opioid receptor.
Residue:
372
  
Inhibitor
Name:
BDBM50278337
Synonyms:
CHEMBL470617 | Naltrexone methiodide
Type:
Small organic molecule
Emp. Form.:
C21H26NO4
Mol. Mass.:
356.4349
SMILES:
C[N+]1(CC2CC2)CC[C@@]23[C@H]4Oc5c2c(C[C@@H]1[C@]3(O)CCC4=O)ccc5O
: