Target
Acyl-CoA:cholesterol acyltransferase
Ligand
BDBM50054297
Substrate
Meas. Tech.
ChEMBL_28664 (CHEMBL649062)
IC50
18±n/a nM
Citation
 White, ADCreswell, MWChucholowski, AWBlankley, CJWilson, MWBousley, RFEssenburg, ADHamelehle, KLKrause, BRStanfield, RLDominick, MANeub, M Heterocyclic ureas: inhibitors of acyl-CoA:cholesterol O-acyltransferase as hypocholesterolemic agents. J Med Chem 39:4382-95 (1996)  
Target
Name:
Acyl-CoA:cholesterol acyltransferase
Synonyms:
ACAT
Type:
Mol. Mass.:
35405.31
Organism:
Oryctolagus cuniculus
Description:
Residue:
305
  
Inhibitor
Name:
BDBM50054297
Synonyms:
1-(2,6-Diisopropyl-phenyl)-3-(5-tridecyl-[1,3,4]oxadiazol-2-yl)-urea | CHEMBL442216
Type:
Small organic molecule
Emp. Form.:
C28H46N4O2
Mol. Mass.:
470.6904
SMILES:
CCCCCCCCCCCCCc1nnc(NC(=O)Nc2c(cccc2C(C)C)C(C)C)o1
: