Target
Protein Rev
Ligand
BDBM50503726
Substrate
Meas. Tech.
ChEMBL_1811902 (CHEMBL4311362)
IC50
19000±n/a nM
Citation
 Simon, BWalmsley, CJackson, VJGarvey, EPSlater, MJBerrisford, DJGardiner, JM Evaluation of neomycin analogues for HIV-1 RRE RNA recognition identifies enhanced activity simplified neamine analogues. Bioorg Med Chem Lett 29:339-341 (2019)  
Target
Name:
Protein Rev
Synonyms:
Human immunodeficiency virus type 1 REV rev
Type:
PROTEIN
Mol. Mass.:
13078.11
Organism:
Human immunodeficiency virus 1
Description:
ChEMBL_79479
Residue:
116
  
Inhibitor
Name:
BDBM50503726
Synonyms:
CHEMBL4483318
Type:
Small organic molecule
Emp. Form.:
C20H34N4O8
Mol. Mass.:
458.506
SMILES:
[H][C@]1(O[C@@H]2[C@@H](N)C[C@@H](N)[C@H](O)[C@H]2O)O[C@H](CNCc2ccc(O)c(OC)c2)[C@@H](O)[C@H](O)[C@H]1N
: