Target
Proteinase-activated receptor 2
Ligand
BDBM50503927
Substrate
Meas. Tech.
ChEMBL_1812458 (CHEMBL4311918)
IC50
480±n/a nM
Citation
 Majewski, MWGandhi, DMRosas, RKodali, RArnold, LADockendorff, C Design and Evaluation of Heterobivalent PAR1-PAR2 Ligands as Antagonists of Calcium Mobilization. ACS Med Chem Lett 10:121-126 (2019)  
Target
Name:
Proteinase-activated receptor 2
Synonyms:
F2RL1 PAR2 | PAR2_HUMAN
Type:
PROTEIN
Mol. Mass.:
44152.54
Organism:
Homo sapiens (Human)
Description:
ChEMBL_1497756
Residue:
397
  
Inhibitor
Name:
BDBM50503927
Synonyms:
CHEMBL4470628
Type:
Small organic molecule
Emp. Form.:
C26H30FN5O4
Mol. Mass.:
495.5459
SMILES:
CC(C)c1cc(nn2cc(nc12)C(=O)N1CCN(CC1(C)C)C(=O)CCC(O)=O)-c1ccc(F)cc1
: