Target
D(2) dopamine receptor
Ligand
BDBM50443101
Substrate
Meas. Tech.
ChEMBL_1814791 (CHEMBL4314365)
Ki
0.490000±n/a nM
Citation
 Wróbel, MZChodkowski, AHerold, FMarciniak, MDawidowski, MSiwek, AStarowicz, GStachowicz, KSzewczyk, BNowak, GBelka, MB?czek, TSata?a, GBojarski, AJTur?o, J Synthesis and biological evaluation of new multi-target 3-(1H-indol-3-yl)pyrrolidine-2,5-dione derivatives with potential antidepressant effect. Eur J Med Chem 183:0 (2019)  
Target
Name:
D(2) dopamine receptor
Synonyms:
D(2) dopamine receptor DOPAMINE D2 Long DRD2 Dopamine D2 receptor Dopamine D2 receptor (D2R) Dopamine2-like | d2
Type:
Cell-surface receptors
Mol. Mass.:
50647.10
Organism:
Homo sapiens (Human)
Description:
P14416
Residue:
443
  
Inhibitor
Name:
BDBM50443101
Synonyms:
Cariprazine | RGH-188
Type:
Small organic molecule
Emp. Form.:
C21H32Cl2N4O
Mol. Mass.:
427.411
SMILES:
CN(C)C(=O)N[C@H]1CC[C@H](CCN2CCN(CC2)c2cccc(Cl)c2Cl)CC1
: