Target
Phospholipase A2, membrane associated
Ligand
BDBM50055341
Substrate
Meas. Tech.
ChEMBL_156219 (CHEMBL767819)
IC50
67000±n/a nM
Citation
 Dillard, RDBach, NJDraheim, SEBerry, DRCarlson, DGChirgadze, NYClawson, DKHartley, LWJohnson, LMJones, NDMcKinney, ERMihelich, EDOlkowski, JLSchevitz, RWSmith, ACSnyder, DWSommers, CDWery, JP Indole inhibitors of human nonpancreatic secretory phospholipase A2. 2. Indole-3-acetamides with additional functionality. J Med Chem 39:5137-58 (1997)  
Target
Name:
Phospholipase A2, membrane associated
Synonyms:
GIIC sPLA2 NPS-PLA2 Non-pancreatic secretory phospholipase A2 (hnps-PLA2) PLA2B PLA2L Phospholipase A2 group IIA | RASF-A
Type:
Hydrolase
Mol. Mass.:
16101.20
Organism:
Homo sapiens (Human)
Description:
The human nps PLA2 was cloned, and expressed in E. coli. There was a refolding process in the purification.
Residue:
144
  
Inhibitor
Name:
BDBM50055341
Synonyms:
CHEMBL149502 [3-(1-Benzyl-3-carbamoylmethyl-2-methyl-1H-indol-5-yloxy)-propyl]-phosphonic acid | hnpsPLA2-IIa Inhibitor, 1
Type:
Small organic molecule
Emp. Form.:
C21H25N2O5P
Mol. Mass.:
416.4074
SMILES:
Cc1c(CC(N)=O)c2cc(OCCCP(O)(O)=O)ccc2n1Cc1ccccc1
: