Target
Integrase
Ligand
BDBM50055710
Substrate
Meas. Tech.
ChEMBL_88614 (CHEMBL701718)
IC50
>100000±n/a nM
Citation
 Zhao, HNeamati, NHong, HMazumder, AWang, SSunder, SMilne, GWPommier, YBurke, TR Coumarin-based inhibitors of HIV integrase. J Med Chem 40:242-9 (1997)  
Target
Name:
Integrase
Synonyms:
Human immunodeficiency virus type 1 integrase
Type:
PROTEIN
Mol. Mass.:
32231.48
Organism:
Human immunodeficiency virus 1
Description:
ChEMBL_90865
Residue:
288
  
Inhibitor
Name:
BDBM50055710
Synonyms:
4-HYDROXY-2H-CHROMEN-2-ONE 4-hydroxycoumarin | CHEMBL301141
Type:
Small organic molecule
Emp. Form.:
C9H6O3
Mol. Mass.:
162.1421
SMILES:
Oc1cc(=O)oc2ccccc12
: