Target
D(2) dopamine receptor
Ligand
BDBM50055721
Substrate
Meas. Tech.
ChEMBL_62398 (CHEMBL672953)
Ki
2.6±n/a nM
Citation
 Wustrow, DJSmith, WJCorbin, AEDavis, MDGeorgic, LMPugsley, TAWhetzel, SZHeffner, TGWise, LD 3-[[(4-Aryl-1-piperazinyl)alkyl]cyclohexyl]-1H-indoles as dopamine D2 partial agonists and autoreceptor agonists. J Med Chem 40:250-9 (1997)  
Target
Name:
D(2) dopamine receptor
Synonyms:
DOPAMINE D2 DOPAMINE D2 Short Dopamine D2 receptor Drd2
Type:
G Protein-Coupled Receptor (GPCR)
Mol. Mass.:
50931.60
Organism:
Rattus norvegicus (rat)
Description:
P61169
Residue:
444
  
Inhibitor
Name:
BDBM50055721
Synonyms:
3-{4-[2-(4-Pyridin-2-yl-piperazin-1-yl)-ethyl]-cyclohexyl}-1H-indole | CHEMBL423499
Type:
Small organic molecule
Emp. Form.:
C25H32N4
Mol. Mass.:
388.5484
SMILES:
C(CN1CCN(CC1)c1ccccn1)[C@H]1CC[C@@H](CC1)c1c[nH]c2ccccc12
: