Target
Solute carrier family 22 member 1
Ligand
BDBM50386381
Substrate
Meas. Tech.
ChEMBL_1823590 (CHEMBL4323354)
IC50
21890±n/a nM
Citation
 Meyer, MJNeumann, VEFriesacher, HRZdrazil, BBrockmöller, JTzvetkov, MV Opioids as Substrates and Inhibitors of the Genetically Highly Variable Organic Cation Transporter OCT1. J Med Chem 62:9890-9905 (2019)  
Target
Name:
Solute carrier family 22 member 1
Synonyms:
Adrenergic Alpha Organic cation transporter 1 SLC22A1 hOCT1
Type:
Enzyme Catalytic Domain
Mol. Mass.:
61154.85
Organism:
Homo sapiens (Human)
Description:
Adrenergic Alpha 0 HUMAN::O15245
Residue:
554
  
Inhibitor
Name:
BDBM50386381
Synonyms:
Nucynta Tapentadol
Type:
Small organic molecule
Emp. Form.:
C14H23NO
Mol. Mass.:
221.3385
SMILES:
CC[C@H]([C@@H](C)CN(C)C)c1cccc(O)c1
: