Target
Lanosterol 14-alpha demethylase
Ligand
BDBM50505765
Substrate
Meas. Tech.
ChEMBL_1823981 (CHEMBL4323745)
IC50
<1000±n/a nM
Citation
 Friggeri, LHargrove, TYWawrzak, ZGuengerich, FPLepesheva, GI Validation of Human Sterol 14?-Demethylase (CYP51) Druggability: Structure-Guided Design, Synthesis, and Evaluation of Stoichiometric, Functionally Irreversible Inhibitors. J Med Chem 62:10391-10401 (2019)  
Target
Name:
Lanosterol 14-alpha demethylase
Synonyms:
CP51A_HUMAN CYP51A1 Cytochrome P450 51 LDM P450-14DM P450LI Sterol 14-alpha demethylase
Type:
Protein
Mol. Mass.:
56817.21
Organism:
Homo sapiens (Human)
Description:
Q16850
Residue:
503
  
Inhibitor
Name:
BDBM50505765
Synonyms:
CHEMBL4435160
Type:
Small organic molecule
Emp. Form.:
C37H25ClF2N6O2
Mol. Mass.:
659.083
SMILES:
Fc1ccc(cc1)-c1ccc([C@H](Cn2ccnc2)NC(=O)c2ccc(cc2)-c2nnc(o2)-c2cc(F)cc(c2)-c2ccccn2)c(Cl)c1
: