Target
Nuclear receptor ROR-gamma
Ligand
BDBM50506048
Substrate
Meas. Tech.
ChEMBL_1824704 (CHEMBL4324468)
IC50
5.0±n/a nM
Citation
 Hoegenauer, KKallen, JJiménez-Núñez, EStrang, RErtl, PCooke, NGHintermann, SVoegtle, MBetschart, CMcKay, DJJWagner, JOttl, JBeerli, CBillich, ADawson, JKaupmann, KStreiff, MGobeau, NHarlfinger, SStringer, RGuntermann, C Structure-Based and Property-Driven Optimization of  J Med Chem 62:10816-10832 (2019)  
Target
Name:
Nuclear receptor ROR-gamma
Synonyms:
NR1F3 Nuclear receptor ROR-gamma (RORC) RAR-related orphan receptor C (RORc) RORG RZRG Retinoid-related orphan receptor-gamma (RORc)
Type:
Enzyme Catalytic Domain
Mol. Mass.:
58218.40
Organism:
Homo sapiens (Human)
Description:
P51449
Residue:
518
  
Inhibitor
Name:
BDBM50506048
Synonyms:
CHEMBL4513808
Type:
Small organic molecule
Emp. Form.:
C24H24Cl2F3N3O2
Mol. Mass.:
514.367
SMILES:
Cc1c(nc(C2CC2)n1-c1c(Cl)ccc(N2CC3(CC(C3)C(O)=O)C2)c1Cl)C1(CC1)C(F)(F)F
: