Target
Nuclear receptor ROR-gamma
Ligand
BDBM50506046
Substrate
Meas. Tech.
ChEMBL_1824704 (CHEMBL4324468)
IC50
21±n/a nM
Citation
 Hoegenauer, KKallen, JJiménez-Núñez, EStrang, RErtl, PCooke, NGHintermann, SVoegtle, MBetschart, CMcKay, DJJWagner, JOttl, JBeerli, CBillich, ADawson, JKaupmann, KStreiff, MGobeau, NHarlfinger, SStringer, RGuntermann, C Structure-Based and Property-Driven Optimization of  J Med Chem 62:10816-10832 (2019)  
Target
Name:
Nuclear receptor ROR-gamma
Synonyms:
NR1F3 Nuclear receptor ROR-gamma (RORC) RAR-related orphan receptor C (RORc) RORG RZRG Retinoid-related orphan receptor-gamma (RORc)
Type:
Enzyme Catalytic Domain
Mol. Mass.:
58218.40
Organism:
Homo sapiens (Human)
Description:
P51449
Residue:
518
  
Inhibitor
Name:
BDBM50506046
Synonyms:
CHEMBL4549748
Type:
Small organic molecule
Emp. Form.:
C19H13Cl3F3N3O3
Mol. Mass.:
494.679
SMILES:
Cc1c(nc(-c2ccc(Cl)o2)n1-c1c(Cl)ccc(N2CC(C2)C(O)=O)c1Cl)C(F)(F)F
: