Target
Nuclear receptor ROR-gamma
Ligand
BDBM50506052
Substrate
Meas. Tech.
ChEMBL_1824704 (CHEMBL4324468)
IC50
4.0±n/a nM
Citation
 Hoegenauer, KKallen, JJiménez-Núñez, EStrang, RErtl, PCooke, NGHintermann, SVoegtle, MBetschart, CMcKay, DJJWagner, JOttl, JBeerli, CBillich, ADawson, JKaupmann, KStreiff, MGobeau, NHarlfinger, SStringer, RGuntermann, C Structure-Based and Property-Driven Optimization of  J Med Chem 62:10816-10832 (2019)  
Target
Name:
Nuclear receptor ROR-gamma
Synonyms:
NR1F3 Nuclear receptor ROR-gamma (RORC) RAR-related orphan receptor C (RORc) RORG RZRG Retinoid-related orphan receptor-gamma (RORc)
Type:
Enzyme Catalytic Domain
Mol. Mass.:
58218.40
Organism:
Homo sapiens (Human)
Description:
P51449
Residue:
518
  
Inhibitor
Name:
BDBM50506052
Synonyms:
CHEMBL4446191
Type:
Small organic molecule
Emp. Form.:
C22H22Cl3N3O3
Mol. Mass.:
482.787
SMILES:
CC(C)Cc1nc(-c2ccc(Cl)o2)n(c1C)-c1c(Cl)ccc(N2CC(C2)C(O)=O)c1Cl
: