Target
Endothelin receptor type B
Ligand
BDBM50058099
Substrate
Meas. Tech.
ChEMBL_63685 (CHEMBL670643)
IC50
25700±n/a nM
Citation
 Wu, CChan, MFStavros, FRaju, BOkun, ICastillo, RS Structure-activity relationships of N2-aryl-3-(isoxazolylsulfamoyl)-2-thiophenecarboxamides as selective endothelin receptor-A antagonists. J Med Chem 40:1682-9 (1997)  
Target
Name:
Endothelin receptor type B
Synonyms:
EDNRB ENDOTHELIN B ETRB Endothelin receptor non-selective type | Endothelin receptor, ET-A/ET-B
Type:
Enzyme Catalytic Domain
Mol. Mass.:
49664.00
Organism:
Homo sapiens (Human)
Description:
ENDOTHELIN B EDNRB HUMAN::P24530
Residue:
442
  
Inhibitor
Name:
BDBM50058099
Synonyms:
Acetic acid 2-(6-{[3-(4-chloro-3-methyl-isoxazol-5-ylsulfamoyl)-thiophene-2-carbonyl]-amino}-benzo[1,3]dioxol-5-yl)-ethyl ester | CHEMBL296927
Type:
Small organic molecule
Emp. Form.:
C20H18ClN3O8S2
Mol. Mass.:
527.955
SMILES:
CC(=O)OCCc1cc2OCOc2cc1NC(=O)c1sccc1S(=O)(=O)Nc1onc(C)c1Cl
: