Target
P2X purinoceptor 4
Ligand
BDBM50506178
Substrate
Meas. Tech.
ChEMBL_1824988 (CHEMBL4324752)
IC50
13±n/a nM
Citation
 Werner, SMesch, SHillig, RCTer Laak, AKlint, JNeagoe, ILaux-Biehlmann, ADahllöf, HBräuer, NPuetter, VNubbemeyer, RSchulz, SBairlein, MZollner, TMSteinmeyer, A Discovery and Characterization of the Potent and Selective P2X4 Inhibitor  J Med Chem 62:11194-11217 (2019)  
Target
Name:
P2X purinoceptor 4
Synonyms:
ATP receptor P2RX4_HUMAN Purinergic receptor | Purinergic, P2X4
Type:
Enzyme Catalytic Domain
Mol. Mass.:
43374.70
Organism:
Homo sapiens (Human)
Description:
Purinergic, P2X4 0 HUMAN::Q99571
Residue:
388
  
Inhibitor
Name:
BDBM50506178
Synonyms:
CHEMBL4555657
Type:
Small organic molecule
Emp. Form.:
C20H22ClFN2O5S
Mol. Mass.:
456.915
SMILES:
NS(=O)(=O)c1cc(NC(=O)Cc2c(F)cccc2Cl)ccc1OCC1CCOCC1
: