Target
Oxytocin receptor
Ligand
BDBM50044677
Substrate
Meas. Tech.
ChEMBL_1825463 (CHEMBL4325227)
EC50
3.0±n/a nM
Citation
 Pflimlin, EZhou, ZAmso, ZFu, QLee, CMuppiddi, AJoseph, SBNguyen-Tran, VShen, W Engineering a Potent, Long-Acting, and Periphery-Restricted Oxytocin Receptor Agonist with Anorexigenic and Body Weight Reducing Effects. J Med Chem 63:382-390 (2020)  
Target
Name:
Oxytocin receptor
Synonyms:
OT-R OXYR_HUMAN | Oxytocin
Type:
Enzyme Catalytic Domain
Mol. Mass.:
42793.26
Organism:
Homo sapiens (Human)
Description:
Oxytocin OXTR HEK293::B2R9L7
Residue:
389
  
Inhibitor
Name:
BDBM50044677
Synonyms:
CHEBI:59204 | Carbetocin
Type:
Small organic molecule
Emp. Form.:
C45H69N11O12S
Mol. Mass.:
988.161
SMILES:
[H][C@]1(NC(=O)[C@H](Cc2ccc(OC)cc2)NC(=O)CCCSC[C@H](NC(=O)[C@H](CC(N)=O)NC(=O)[C@H](CCC(N)=O)NC1=O)C(=O)N1CCC[C@H]1C(=O)N[C@@H](CC(C)C)C(=O)NCC(N)=O)[C@@H](C)CC
: