Target
Phosphatidylinositol 3-kinase catalytic subunit type 3
Ligand
BDBM50506332
Substrate
Meas. Tech.
ChEMBL_1825530 (CHEMBL4325294)
IC50
1.6±n/a nM
Citation
 Henley, ZAAmour, ABarton, NBantscheff, MBergamini, GBertrand, SMConvery, MDown, KDümpelfeld, BEdwards, CDGrandi, PGore, PMKeeling, SLivia, SMallett, DMaxwell, APrice, MRau, CReinhard, FBMRowedder, JRowland, PTaylor, JAThomas, DAHessel, EMHamblin, JN Optimization of Orally Bioavailable PI3K? Inhibitors and Identification of Vps34 as a Key Selectivity Target. J Med Chem 63:638-655 (2020)  
Target
Name:
Phosphatidylinositol 3-kinase catalytic subunit type 3
Synonyms:
BC033004 PIK3C3 Phosphatidylinositol 3-kinase catalytic subunit type 3 (PIK3C3) Phosphoinositide 3-Kinase (PI3K), Vps34 PtdIns-3-kinase type 3 hVPS34
Type:
Enzyme
Mol. Mass.:
101551.30
Organism:
Homo sapiens (Human)
Description:
Recombinant human Vps34 protein was expressed as monomeric GST-fusion and purified.
Residue:
887
  
Inhibitor
Name:
BDBM50506332
Synonyms:
CHEMBL4561242
Type:
Small organic molecule
Emp. Form.:
C28H41N3O7S
Mol. Mass.:
563.706
SMILES:
COCCS(=O)(=O)Nc1cc(cnc1OC)-c1cc2COCc2c(OC[C@H](C)N2CCC(CC2)C(C)(C)O)c1
: