Target
Cytochrome P450 3A5
Ligand
BDBM39347
Substrate
Meas. Tech.
ChEMBL_1825929 (CHEMBL4325693)
Kd
100±n/a nM
Citation
 Wright, WCChenge, JWang, JGirvan, HMYang, LChai, SCHuber, ADWu, JOladimeji, POMunro, AWChen, T Clobetasol Propionate Is a Heme-Mediated Selective Inhibitor of Human Cytochrome P450 3A5. J Med Chem 63:1415-1433 (2020)  
Target
Name:
Cytochrome P450 3A5
Synonyms:
CP3A5_HUMAN Cytochrome P450 3A5 | Cytochrome P450 3A5 (CYP3A5)
Type:
Protein
Mol. Mass.:
57118.00
Organism:
Homo sapiens (Human)
Description:
P20815
Residue:
502
  
Inhibitor
Name:
BDBM39347
Synonyms:
CLOBETASOL PROPIONATE SMR000058745 | cid_32798
Type:
Small organic molecule
Emp. Form.:
C25H32ClFO5
Mol. Mass.:
466.97
SMILES:
CCC(=O)O[C@@]1([C@@H](C)C[C@H]2[C@@H]3CCC4=CC(=O)C=C[C@]4(C)[C@@]3(F)[C@@H](O)C[C@]12C)C(=O)CCl
: