Target
Cholecystokinin receptor type A
Ligand
BDBM50059319
Substrate
Meas. Tech.
ChEMBL_47639 (CHEMBL659910)
IC50
1600±n/a nM
Citation
 Castro, JLBroughton, HBRussell, MGRathbone, DWatt, APBall, RGChapman, KLPatel, SSmith, AJMarshall, GRMatassa, VG 5-(Piperidin-2-yl)- and 5-(homopiperidin-2-yl)-1,4-benzodiazepines: high-affinity, basic ligands for the cholecystokinin-B receptor. J Med Chem 40:2491-501 (1997)  
Target
Name:
Cholecystokinin receptor type A
Synonyms:
CCKAR_RAT Cholecystokinin peripheral Cholecystokinin receptor type A
Type:
Enzyme Catalytic Domain
Mol. Mass.:
49676.37
Organism:
RAT
Description:
Cholecystokinin central 0 RAT::P30551
Residue:
444
  
Inhibitor
Name:
BDBM50059319
Synonyms:
1-[(R)-5-(3-Aza-bicyclo[3.2.2]non-3-yl)-1-methyl-2-oxo-2,3-dihydro-1H-benzo[e][1,4]diazepin-3-yl]-3-m-tolyl-urea | CHEMBL420783
Type:
Small organic molecule
Emp. Form.:
C26H31N5O2
Mol. Mass.:
445.5566
SMILES:
CN1c2ccccc2C(=N[C@@H](NC(=O)Nc2cccc(C)c2)C1=O)N1CC2CCC(CC2)C1
: